{"text_format":"1","workbook":"xlsx","n_sheets":14,"sheets":["User Instructions","NCM act and schedules","Activity database","Restaurant and cafes calculator","Cineman and Theatres","Leisure centres","Office calculator","Retail calculator","Industrial calculator","Education calculator","Multi-residential calculator","Other building type calculator","Average flow rate calculator","Schedule of changes"],"not_rendered":{"charts":0,"images":3,"macros":1,"external_links":5,"defined_names":85,"comments":7,"pivot_tables":0},"unopened":[],"bounds":{"document_bytes":16777216,"sheet_cells":100000,"rows_first":2000,"rows_last":500,"rows_between":2000,"halvings":0,"cell_chars":16384,"cell_head_chars":4096},"cells_cut":0,"cells_raw":0,"read":"whole","date_system":"1900"}

{"sheet":"User Instructions","index":0,"n_rows":28,"n_cols":17,"rows_kept":28,"cut":false,"hidden":false,"merged":[[20,2,20,10],[19,2,19,10],[9,1,9,2],[7,1,7,2],[7,3,7,5],[9,3,9,5],[15,1,15,10],[12,1,13,10]]}
[]
[null,"BREEAM-NOR 6.1 Wat 01 Water consumption: User instructions"]
[]
[null,"Building Details",null,null,null,null,null,null,null,null,null,null,null,null,null,null,""]
[]
[null,"Building type","Please select",null,null,null,{"$f":"IF(UI_BT=\"Please select\",\"Note: the appropriate building type must be selected to enable the relevant calculator tool.\",\"\")","v":"Note: the appropriate building type must be selected to enable the relevant calculator tool."}]
[]
[null,"Building name"]
[]
[null,"BREEAM assessment reference no."]
{"$rows_left_out":19}
{"sheet":"NCM act and schedules","index":1,"n_rows":359,"n_cols":30,"rows_kept":359,"cut":false,"hidden":true,"merged":[]}
["List of activities and daily schedules per week type"]
[]
["These are the daily schedules for the Activities listed in the activities Database as per 11/08/10."]
["They correspond to the daily schedule for Mondays."]
["The Week Type identifies potential differences in Monday schedules for different weeks of the year with different patterns of occupancy (e.g. schools full time and schools summer periods)."]
["Week 1 (WK1) normally identifies standard operation (working weeks)"]
[]
["Activity ID","Activity Name","Building Type","OCCUPANCY_DENS","WEEKLY_SCHEDULE","Week Type","h00","h01","h02","h03","h04","h05","h06","h07","h08","h09","h10","h11","h12","h13","h14","h15","h16","h17","h18","h19","h20","h21","h22","h23"]
[1000,"Cupboard","B1 Offices and Workshop businesses",0.11,"Office_Store_Occ_WK1",{"$f":"RIGHT(E9,3)","v":"WK1"},0,0,0,0,0,0,0,0,1,1,1,1,1,1,1,1,1,1,0,0,0,0,0,0]
[1001,"Circulation area (corridors and stairways)","B1 Offices and Workshop businesses",0.11733333333333337,"Office_Circulation_Occ_WK1",{"$f":"RIGHT(E10,3)","v":"WK1"},0,0,0,0,0,0,0,0.25,0.5,1,1,1,0.75,0.75,1,1,1,0.5,0.25,0,0,0,0,0]
{"$rows_left_out":350}
{"sheet":"Activity database","index":2,"n_rows":96,"n_cols":58,"rows_kept":96,"cut":false,"hidden":true,"merged":[[1,6,1,7]]}
[1,2,3,4,5,6,7,8,9,10,11,12,13,14,15,16,17,18,19,20,21,22,23,24,25,26,27,28,29,30,31,32,33,34,35,36,37,38,39,40,41,42,43,44,null,1,2,3,4,5,6,7,8]
[null,null,"Building occupation data",null,null,"User","Gender ratio",null,"Component uses/person/day (unless stated differently for specific uses or activity areas)",null,null,null,null,null,null,null,null,null,null,null,null,null,null,null,null,null,"Usage factors",null,null,null,null,null,null,null,null,null,null,null,null,null,null,null,"Adjustment factors",null,null,"Microcomponent Performance Levels for BREEAM water consumption method benchmarking"]
["Building category and main activity area/function","Description","Occupant density (person/m2)","No. days/yr building occupied","default daily hrs of operation","Type","Ratio male users","Ratio female users","WC - male (urinals installed)","WC - male (no urinals installed)","WC - female","Urinal","Wash hand basin taps","Shower use","Shower use (bath present)","Bath use (no shower present) ","Bath use (shower present)","Kitchen taps - kitchenette","Kitchen taps - pre-rinse nozzle","blank column","Dishwasher","Washing machine","Waste disposal unit","Fixed use - vessel filling","Fixed use - food preparation","Fixed use - kitchen cleaning","WC (factor of use","Urinals (factor of use)","Wash hand basin taps (mins/use)","Showers (no bath present) - mins/use","Showers (bath present) mins/use","Bath (No shower present) ratio","Bath (shower present) ratio","Kitchen taps - kitchenette mins/day","Kitchen taps - pre-rinse nozzle","blank","Dishwasher","Washing machine","Waste dispoal unit","Fixed use - vessel filling","Fixed use - food preparation","Fixed use - kitchen cleaning","Baths","Taps",null,"Component","Baseline","Level 1","Level 2","Level 3","Level 4","Level 5","Unit",null,"BREEAM credit benchmarks",null,null,"Sources of data/information"]
["Office","Offices and workshop business (including those with a basic (category 1) laboratory area)","-",253,10,"Staff",0.5,0.5,1,4,4,3,4,0.03,"N/A","N/A","N/A","-","-","-","-","N/A","-",1.58,"-","-",1,1,0.25,5.6,4.37,1,1,"-","-","-","-","-","-",1,"-","-",0.4,0.67700000000000005,null,"WC - male (urinals installed)",6,4.5,4,3.75,3.5,3,"Effective flush volume (litres)",null,0,"0 credits",null,"SD129: Certification and Listing of Low Flush WC appliances"]
["Office - Office areas","Cellular or open plan office space, including staff kitchen where present/adjacent and reception areas. Exlcude meeting rooms, visitor waiting or circulation areas.",0.111,null,null,null,null,null,null,null,null,null,null,null,null,null,null,1,null,null,0.04,null,null,null,null,null,null,null,null,null,null,null,null,0.67,null,null,1,"N/A",null,null,null,null,null,null,null,"WC - male (no urinals installed)",6,4.5,4,3.75,3.5,3,"Effective flush volume (litres)",null,0.125,"1 credit",null,"Waterwise "]
["Office - Staff canteen dining area","Seated dining areas that accompany a permanently staffed kitchen preparing food for consumption on the premises (excludes small un-staffed kitchen's used by office staff to re-heat food, make tea etc.)",4.3299999999999998E-2,null,null,null,null,null,null,null,null,null,null,null,null,null,null,null,"see usage factor",null,"see usage factor","N/A","see usage factor",null,{"$f":"IF('Office calculator'!F16=\"yes\",'Office calculator'!G16*0.868*2.674,\"see note\")","v":"see note"},{"$f":"IF('Office calculator'!F16=\"yes\",'Office calculator'!G16*6.314*0.868,\"See note\")","v":"See note"},null,null,null,null,null,null,null,null,60,null,0.217,"N/A",30,null,1,1,null,null,null,"WC - female",6,4.5,4,3.75,3.5,3,"Effective flush volume (litres)",null,0.25,"2 credits",null,"Water efficient product labelling scheme"]
["Office - Small workshop / laboratory space","Small scale workshop or category 1 laboratory area",6.8000000000000005E-2,null,null,null,null,null,null,null,null,null,null,null,null,null,null,null,null,null,null,null,null,null,null,null,null,null,null,null,null,null,null,null,null,null,null,null,null,null,null,null,null,null,null,"Wash hand basin taps",10,8,6,5,3.75,3,"Volume (litres/min)",null,0.4,"3 credits",null,"Water Supply (water fittings) Regulations 1999: WC Suite Performance Specifications"]
["Office - Fitness suite/gym (with changing facility and showers)","A fitness suite or gym that is part of the office building/development  and used by the building's employees only. The gym will have its own changing facility with showers.",0,null,null,null,null,null,null,null,null,null,null,0.154,null,null,null,null,null,null,null,null,null,0.05,null,null,null,null,null,null,null,null,null,null,null,null,null,null,null,null,null,null,null,null,null,"Showers",12,10,8,6,4,3.5,"Volume (litres/min)",null,0.5,"4 credits",null,"(Very early) Draft BS8542"]
["Industrial - 24hr x 7 day operation","General and specialist industrail and warehouse and storage units operating 24 hours a day 7 days a week.","-",365,24,"Staff",0.5,0.5,1,4,4,3,4,0.03,"N/A","N/A","N/A","-","-","-","-","N/A","-",1.58,"-","-",1,1,0.25,5.6,4.37,1,1,"-","-","-","-","-","-",1,"-","-",0.4,0.67700000000000005,null,"Baths",200,180,160,140,120,100,"Volume (litres)",null,0.55000000000000004,"5 credits",null,"SD174: Certification and Listing of Water Efficient Terminal Fittings (table 2.0)"]
["Industrial - typical business hours of operation","General and specialist industrial and warehouse and storage units operating 24 hours a day 7 days a week.","-",253,10,"Staff",0.5,0.5,1,4,4,3,4,0.03,"N/A","N/A","N/A","-","-","-","-","N/A","-",1.58,"-","-",1,1,0.25,5.6,4.37,1,1,"-","-","-","-","-","-",1,"-","-",0.4,0.67700000000000005,null,"Urinal (2 or more urinals) - Automatically operated flushing cistern",7.5,6,3,1.5,0.75,0,"Volume (litres/bowl/hour)",null,0.65,"Exemplary level",null,"CLG Water Calculation Method for New Dwelling"]
{"$rows_left_out":87}
{"sheet":"Restaurant and cafes calculator","index":3,"n_rows":0,"n_cols":0,"rows_kept":0,"cut":false,"hidden":true,"merged":[]}

{"sheet":"Cineman and Theatres","index":4,"n_rows":0,"n_cols":0,"rows_kept":0,"cut":false,"hidden":true,"merged":[]}

{"sheet":"Leisure centres","index":5,"n_rows":0,"n_cols":0,"rows_kept":0,"cut":false,"hidden":true,"merged":[]}

{"sheet":"Office calculator","index":6,"n_rows":236,"n_cols":20,"rows_kept":236,"cut":false,"hidden":true,"merged":[[28,1,29,1],[31,1,32,1],[10,2,10,3],[53,7,63,12],[31,7,34,12],[25,1,26,1],[13,2,13,4],[14,2,14,4],[15,2,15,4],[16,2,16,4],[76,7,78,12],[28,7,30,12],[12,7,13,14],[15,7,15,14],[16,7,16,14],[22,7,24,12]]}
[]
[null,"BREEAM-NOR v6.1 Wat 01 Water consumption: Water efficiency calculator for new non domestic office buildings"]
[]
[null,"Building details",null,null,null,null,null,null,"Key"]
[null,null,null,null,null,null,null,null,null,"Cells that are white with a black border require user input (data entry/option selection)"]
[null,"Building name",{"$f":"'User Instructions'!D8:F8","v":{"$error":"#VALUE!"}},null,null,null,null,null,null,"Cells that are light grey contain fixed data or a formula and do not require any user input"]
[null,null,null,null,null,null,null,null,null,"Cells that are dark grey are user input cells which are not applicable due to either building type or user input/option selection or default setting. Note these cells can change to ones requiring user input depending on the users option selection in other cells."]
[null,"BRE assessment reference no.",{"$f":"'User Instructions'!D10:F10","v":{"$error":"#VALUE!"}},null,null,null,null,null,">"]
[]
[null,"Building type","Description of building type",null,"Default occupancy","Default annual days/operation","Default daily hours of operation"]
{"$rows_left_out":227}
{"sheet":"Retail calculator","index":7,"n_rows":237,"n_cols":21,"rows_kept":237,"cut":false,"hidden":true,"merged":[[9,2,9,4],[10,2,10,4],[20,2,20,4],[20,7,20,15],[21,2,21,4],[7,9,9,12],[19,2,19,4],[37,1,38,1],[37,7,39,12],[47,7,48,12],[31,1,32,1],[34,1,35,1],[34,7,36,12],[59,7,69,12],[10,7,11,12],[56,7,57,12],[82,7,83,12],[11,2,11,5],[18,2,18,4],[28,7,30,12],[15,7,16,12],[16,2,16,4],[17,2,17,4],[22,2,22,4]]}
[]
[null,"BREEAM-NOR v6.1 Wat 01 Water consumption: Water efficiency calculator for new non domestic retail buildings"]
[]
[null,"Building details"]
[]
[null,"Building name",{"$f":"'User Instructions'!D8:F8","v":{"$error":"#VALUE!"}}]
[]
[null,"BRE assessment reference no.",{"$f":"'User Instructions'!D10:F10","v":{"$error":"#VALUE!"}}]
[]
[null,"Building type","Description of building type",null,null,"Default annual days/operation","Default daily hours of operation"]
{"$rows_left_out":228}
{"sheet":"Industrial calculator","index":8,"n_rows":236,"n_cols":20,"rows_kept":236,"cut":false,"hidden":true,"merged":[[10,2,10,3],[11,7,11,12],[34,1,35,1],[17,2,17,4],[17,7,17,14],[28,1,29,1],[34,7,36,12],[19,7,19,12],[31,1,32,1],[14,2,14,4],[15,2,15,4],[12,7,13,14],[13,2,13,4],[16,2,16,4],[44,7,45,12],[79,7,80,12],[31,7,33,12],[18,2,18,4],[18,7,18,14],[25,7,27,12],[56,7,58,12],[53,7,54,12]]}
[]
[null,"BREEAM-NOR v6.1 Wat 01 Water consumption: Water efficiency calculator for new non domestic industrial buildings"]
[]
[null,"Building details"]
[]
[null,"Building name",{"$f":"'User Instructions'!D8:F8","v":{"$error":"#VALUE!"}}]
[]
[null,"BRE assessment reference no.",{"$f":"'User Instructions'!D10:F10","v":{"$error":"#VALUE!"}}]
[]
[null,"Building type","Description of building type",null,"Default occupancy","Default annual days/operation","Default daily hours of operation"]
{"$rows_left_out":227}
{"sheet":"Education calculator","index":9,"n_rows":237,"n_cols":20,"rows_kept":237,"cut":false,"hidden":true,"merged":[[12,7,13,12],[13,2,13,4],[16,2,16,4],[16,7,16,14],[10,2,10,3],[17,2,17,4],[37,7,39,12],[21,2,21,4],[17,7,17,14],[14,2,14,4],[15,2,15,4],[34,7,36,12],[28,7,30,12],[18,2,18,4],[37,1,38,1],[47,7,48,12],[56,7,57,12],[75,7,76,12],[19,2,19,4],[20,2,20,4],[22,2,22,4],[31,1,32,1],[34,1,35,1],[59,7,61,12]]}
[]
[null,"BREEAM-NOR v6.1 Wat 01 Water consumption: Water efficiency calculator for new non domestic education buildings"]
[]
[null,"Building details"]
[]
[null,"Building name",{"$f":"'User Instructions'!D8:F8","v":{"$error":"#VALUE!"}}]
[]
[null,"BRE assessment reference no.",{"$f":"'User Instructions'!D10:F10","v":{"$error":"#VALUE!"}}]
[]
[null,"Building type","Description of building type",null,"Default building occupancy","Default annual days/operation","Default daily hours of operation"]
{"$rows_left_out":228}
{"sheet":"Multi-residential calculator","index":10,"n_rows":0,"n_cols":0,"rows_kept":0,"cut":false,"hidden":true,"merged":[]}

{"sheet":"Other building type calculator","index":11,"n_rows":168,"n_cols":19,"rows_kept":168,"cut":false,"hidden":true,"merged":[[75,1,75,7],[73,7,73,15],[68,7,68,8],[72,7,72,8],[70,7,70,8],[72,1,72,6],[3,12,3,15],[3,8,3,11],[4,4,4,7],[3,1,3,2],[34,1,36,1],[14,1,16,1],[18,1,20,1],[22,1,24,1],[26,1,28,1],[30,1,32,1],[10,1,10,2],[11,1,11,2],[3,3,3,7],[12,1,12,2],[84,1,84,4],[86,1,86,4],[10,16,21,20],[52,1,52,2],[38,1,40,1],[42,1,44,1],[50,1,50,2],[48,1,48,2],[46,1,46,2],[76,1,76,6],[78,1,78,6],[54,1,54,2],[56,1,56,2],[68,1,68,6],[70,1,70,6],[73,1,73,6]]}
[]
[null,"BREEAM-NOR v6.1 Wat 01 Water consumption: Other building type calculator"]
[]
[{"$f":"IF(OR(Wat01_building_type=\"\",Wat01_building_type=C151),\"→\",\"\")","v":"→"},"Please select the option that best defines the building type being assessed",null,"Please select",null,null,null,null,"Please specify/describe the building type being assessed:",null,null,null,"g",null,null,null,{"$f":"IF(AND(M4=\"\",OR(Wat01_building_type=C163,Wat01_building_type=C162)),\"←\",\"\")","v":""}]
[null,{"$f":"IF(AND(Wat01_building_type=C163,OR(D5=$H$130,D5=\"\")),\"→\",\"\")","v":""},"Are urinals specified in this residential building type?","No","What is the proportion of urinals to WCs (%)",null,null,null,0,{"$f":"IF(AND(Wat01_building_type=C163,I5=\"\"),\"←\",\"\")","v":""}]
[null,{"$f":"IF(AND(Wat01_building_type=C163,OR(D6=$H$130,D6=\"\")),\"→\",\"\")","v":""},"Please confirm the shower/bath arrangement for this residential building type","Shower only"]
[]
[null,"Water consumption - building microcomponents"]
[]
[null,null,null,"WC ","Urinal (2 or more urinals)","Urinal (1 urinal only)","Wash hand basin taps","Showers","Baths","Kitchen taps: kitchenette","Domestic sized washing machines","Domestic sized dishwashers","Kitchen taps: restaurant (pre-rinse nozzles only)","Waste disposal unit (commercial kitchens only)","Commercial sized dishwashers","Commercial or industrial sized washing machines"]
{"$rows_left_out":159}
{"sheet":"Average flow rate calculator","index":12,"n_rows":101,"n_cols":9,"rows_kept":101,"cut":false,"hidden":false,"merged":[[5,3,5,7],[7,3,7,7],[16,2,16,3],[23,1,23,2],[5,1,5,2],[11,1,11,3],[12,2,12,3],[13,2,13,3],[14,2,14,3],[15,2,15,3],[51,2,51,3],[52,2,52,3],[53,2,53,3],[48,1,48,3],[41,2,41,3],[49,2,49,3],[50,2,50,3],[40,2,40,3],[7,1,7,2],[36,1,36,3],[37,2,37,3],[38,2,38,3],[39,2,39,3],[95,2,95,3],[76,1,76,3],[77,2,77,3],[78,2,78,3],[79,2,79,3],[80,2,80,3],[81,2,81,3],[90,1,90,3],[91,2,91,3],[92,2,92,3],[93,2,93,3],[94,2,94,3],[62,1,62,3],[63,2,63,3],[64,2,64,3],[65,2,65,3],[67,2,67,3],[66,2,66,3]]}
[]
[null,"BREEAM-NOR 6.1 Wat 01 Water consumption: Average flow rate calculator"]
[]
[null,"Building details"]
[]
[null,"Building name",null,{"$f":"IF('User Instructions'!D8:F8=\"\",\"\",'User Instructions'!D8:F8)","v":""}]
[]
[null,"BRE assessment reference no.",null,{"$f":"IF('User Instructions'!D10:F10=\"\",\"\",'User Instructions'!D10:F10)","v":""}]
[]
[null,"WCs"]
{"$rows_left_out":92}
{"sheet":"Schedule of changes","index":13,"n_rows":8,"n_cols":6,"rows_kept":8,"cut":false,"hidden":false,"merged":[[5,5,5,13],[9,5,9,13]]}
[]
[null,"BREEAM-NOR v6.1 Wat 01 Water Consumption"]
[]
[null,"Current version",null,"Release date",null,"Description of changes/additions to previous version resulting in current version"]
[]
[null,"1.00",null,"2023-11-21",null,"Release version."]
[]
[null,"Previous version",null,"Release date"]